Topic Title: I encountered and error while installing AMD Catalyst 13.12
Topic Summary: error while installing AMD Catalyst 13.12
Created On: 02/21/2014 09:28 PM
Status: Post and Reply
Linear : Threading : Single : Branch
Search Topic Search Topic
Topic Tools Topic Tools
View similar topics View similar topics
View topic in raw text format. Print this topic.
 02/21/2014 09:28 PM
User is offline View Users Profile Print this message

Author Icon
moonrays00
Peon

Posts: 1
Joined: 02/21/2014

log:

Supported adapter detected.

Detected a previous installation, /usr/share/ati/amd-uninstall.sh
Dryrun uninstall succeeded continuing with installation.
Check if system has the tools required for installation.
Uninstalling any previously installed drivers.
Forcing uninstall of AMD Catalyst(TM) Proprietary Driver.
No integrity verification is done.
restore of system environment completed
Uninstall fglrx driver complete.
For detailed log of uninstall, please see /etc/ati/fglrx-uninstall.log
System must be rebooted to avoid system instability and potential data loss.
/usr/share/ati/amd-uninstall.sh completed with 0
[Message] Kernel Module : Trying to install a precompiled kernel module.
[Message] Kernel Module : Precompiled kernel module version mismatched.
[Message] Kernel Module : Found kernel module build environment, generating kernel module now.
AMD kernel module generator version 2.1
doing Makefile based build for kernel 2.6.x and higher
rm -rf *.c *.h *.o *.ko *.a .??* *.symvers
make -C /lib/modules/3.11.0-17-generic/build SUBDIRS=/lib/modules/fglrx/build_mod/2.6.x modules
make[1]: Entering directory `/usr/src/linux-headers-3.11.0-17-generic'
CC [M] /lib/modules/fglrx/build_mod/2.6.x/firegl_public.o
CC [M] /lib/modules/fglrx/build_mod/2.6.x/kcl_acpi.o
/lib/modules/fglrx/build_mod/2.6.x/kcl_acpi.c: In function ‘KCL_ACPI_ParseTable’:
/lib/modules/fglrx/build_mod/2.6.x/kcl_acpi.c:999:5: warning: passing argument 1 of ‘(acpi_status (*)(u32, void *, void *))handler’ makes integer from pointer without a cast [enabled by default]
/lib/modules/fglrx/build_mod/2.6.x/kcl_acpi.c:999:5: note: expected ‘u32’ but argument is of type ‘struct acpi_table_header *’
/lib/modules/fglrx/build_mod/2.6.x/kcl_acpi.c:999:5: error: too few arguments to function ‘(acpi_status (*)(u32, void *, void *))handler’
make[2]: *** [/lib/modules/fglrx/build_mod/2.6.x/kcl_acpi.o] Error 1
make[1]: *** [_module_/lib/modules/fglrx/build_mod/2.6.x] Error 2
make[1]: Leaving directory `/usr/src/linux-headers-3.11.0-17-generic'
make: *** [kmod_build] Error 2
build failed with return value 2
[Error] Kernel Module : Failed to compile kernel module - please consult readme.
[Reboot] Kernel Module : update-initramfs


 

What seems to be the problem sir im kinda new so im not that good in reading just need a right explaination for this. 

Statistics
84884 users are registered to the AMD Support and Game forum.
There are currently 2 users logged in.

FuseTalk Hosting Executive Plan v3.2 - © 1999-2014 FuseTalk Inc. All rights reserved.